{"text_format":"1","workbook":"xlsx","n_sheets":13,"sheets":["Página de rosto","Índice","1-Auditoria pré-demolição","2-Detalhes do projeto","3-Estudo documental","4-Como utilizar inventário","5-Cálculo de quantidades"," 6-Inventário de recursos","7-Síntese da auditoria","8-Elemento de construção","9-Lista de resíduos","10-Glossário","Ref"],"not_rendered":{"charts":3,"images":4,"macros":1,"external_links":0,"defined_names":14,"comments":2,"pivot_tables":0},"unopened":[],"bounds":{"document_bytes":16777216,"sheet_cells":100000,"rows_first":2000,"rows_last":500,"rows_between":2000,"halvings":0,"cell_chars":16384,"cell_head_chars":4096},"cells_cut":0,"cells_raw":0,"read":"whole","date_system":"1900"}

{"sheet":"Página de rosto","index":0,"n_rows":26,"n_cols":2,"rows_kept":26,"cut":false,"hidden":false,"merged":[[1,1,18,6],[19,3,19,4],[25,0,25,7]]}
[]
[]
[]
[]
[]
[]
[]
[]
{"$rows_left_out":19}
{"sheet":"Índice","index":1,"n_rows":30,"n_cols":2,"rows_kept":30,"cut":false,"hidden":false,"merged":[[0,0,0,7],[29,0,29,7],[6,1,6,7],[5,1,5,7],[3,1,3,7],[2,1,2,7],[4,1,4,7],[7,1,7,7],[10,1,10,7],[8,1,8,7],[11,1,11,7],[25,0,26,7],[27,0,28,7],[9,1,9,7]]}
["Índice "]
[]
[1,"Auditoria Pré-Demolição"]
[2,"Detalhes do projeto"]
[3,"Estudo documental"]
[4,"Como utilizar o inventário"]
[5,"Cálculo de quantidades"]
[6,"Inventário"]
{"$rows_left_out":23}
{"sheet":"1-Auditoria pré-demolição","index":2,"n_rows":25,"n_cols":1,"rows_kept":25,"cut":false,"hidden":false,"merged":[[24,0,24,7],[9,0,9,7],[0,0,0,7],[3,0,3,7],[4,0,4,7],[5,0,5,7]]}
["Auditoria pré-demolição"]
[]
[]
["A auditoria pré-demolição (APD) consiste numa avaliação dos fluxos de materiais, elementos de construção e resíduos de construção e demolição associados à atividade de demolição ou reabilitação de edifícios, sendo identificados os diversos recursos, as respetivas quantidades e potenciais aplicações facilitando a sua reintrodução na economia. "]
["A APD fornece ao dono da obra um aconselhamento independente sobre materiais e elementos de construção que podem ser reutilizados ou reciclados previamente à demolição ou reabilitação, privilegiando a reutilização de modo a contribuir para a diminuição do carbono incorporado."]
["As auditorias pré-demolição ou reabilitação de edifícios compreendem duas etapas de recolha de informação, o estudo documental e o estudo in situ, que contribuem para a construção do inventário. Com base nessa informação, são efetuadas recomendações dos destinos mais adequados para a valorização dos diversos recursos identificados e a minimização da perigosidade dos mesmos."]
[]
[]
{"$rows_left_out":18}
{"sheet":"2-Detalhes do projeto","index":3,"n_rows":40,"n_cols":3,"rows_kept":40,"cut":false,"hidden":false,"merged":[[0,0,0,4],[35,0,35,4],[30,0,30,4],[3,0,3,4],[9,0,9,4],[15,0,15,4],[20,0,20,4],[25,0,25,4],[1,0,1,4],[2,2,2,4],[4,2,4,4],[5,2,5,4],[6,2,6,4],[7,2,7,4],[10,2,10,4],[11,2,11,4],[12,2,12,4],[13,2,13,4],[14,2,14,4],[16,2,16,4],[17,2,17,4],[18,2,18,4],[19,2,19,4],[21,2,21,4],[22,2,22,4],[23,2,23,4],[24,2,24,4],[26,2,26,4],[27,2,27,4],[28,2,28,4],[29,2,29,4],[31,2,31,4],[32,2,32,4],[33,2,33,4],[34,2,34,4],[36,2,36,4],[37,2,37,4],[38,2,38,4],[39,2,39,4]]}
["Detalhes do projeto"]
["Data da auditoria pré-demolição i"]
[null,null,"<inserir conteúdo>"]
["Identificação do projeto i"]
[null,"Nome do Projeto","<inserir conteúdo>"]
[null,"Morada ","<inserir conteúdo>"]
[null,"Data de construção","<inserir conteúdo>"]
[null,"Tipo de intervenção","<selecionar opção>"]
{"$rows_left_out":33}
{"sheet":"3-Estudo documental","index":4,"n_rows":44,"n_cols":3,"rows_kept":44,"cut":false,"hidden":false,"merged":[[12,2,12,7],[0,0,0,7],[43,0,43,7],[1,0,1,7],[11,0,11,7],[3,0,3,7],[5,0,5,7],[7,0,7,7],[19,2,19,7],[20,2,20,7],[21,2,21,7],[23,2,23,7],[24,2,24,7],[22,0,22,7],[13,2,13,7],[14,2,14,7],[15,2,15,7],[16,2,16,7],[18,2,18,7],[17,0,17,7],[2,2,2,7],[4,2,4,7],[6,2,6,7],[8,2,8,7],[10,2,10,7],[9,0,9,7],[25,2,25,7],[26,2,26,7],[28,2,28,7],[29,2,29,7],[30,2,30,7],[27,0,27,7]]}
["Estudo documental"]
["Idade do edifício (anos)"]
[null,null,"<inserir conteúdo>"]
["Número de pisos (se aplicável)"]
[null,null,"<inserir conteúdo>"]
["Tipologia de construção"]
[]
["Utilização do edifício"]
{"$rows_left_out":37}
{"sheet":"4-Como utilizar inventário","index":5,"n_rows":29,"n_cols":4,"rows_kept":29,"cut":false,"hidden":false,"merged":[[1,0,1,1],[0,0,0,1]]}
["Como utilizar o inventário"]
["O modelo de inventário de reabilitaçãi/demolição de edifícios abrange materiais e elementos passíveis de reutilização e resíduos de construção e demolição que podem ser valorizados ou eliminados tendo em consideração a sua perigosidade e as suas características. O modelo é uma combinação do template adotado no nível 2 do LEVEL(s) com as orientações para auditorias de pré-demolição de edifícios e do protocolo de gestão de RCD na UE, bem como de outros Estados-membros da UE. A síntese da auditoria é gerada automaticamente a partir do inventário exceto no que respeita a custos de deposição em aterro."]
["1.    ID","Identificação única do material ou elemento (exº. código numérico ou alfanumérico)"]
[]
["2.    Material / Elemento","Seleccionar os materiais ou elementos com a seta. Se não encontar a descrição correta na lista faça a adição manualmente. Ao seleccionar um material da lista é automaticamente associado o código do Capítulo 17 do LER. Para resíduos de equipamentos elétridos e eletrónicos, REEE, usar os códigos dos Capítulos 16 e 20 apresentados no separador \"8-Lista de resíduos\"."]
[]
["3.    Código LER","Código de seleção automática relacionado com o material. No caso da utilização de uma descrição de material personalizada, é necessário inserir o código que melhor representa esse material."]
[]
{"$rows_left_out":22}
{"sheet":"5-Cálculo de quantidades","index":6,"n_rows":8,"n_cols":8,"rows_kept":8,"cut":false,"hidden":false,"merged":[[2,6,5,6],[2,0,5,0],[8,0,12,0],[0,0,0,7]]}
["Cálculo de quantidades"]
[null,"Quantidade","D1 (m)","D2 (m)","D3 (m)","Sub-total","Total (m3)"]
["Exº:Vigas de betão",6,0.3,0.3,3.3,{"$f":"E3*D3*C3*B3","v":1.7819999999999996},{"$f":"SUM(F3:F6)","v":4.8599999999999994},{"$f":"G3","v":4.8599999999999994}]
[null,6,0.2,0.25,4.5,{"$f":"E4*D4*C4*B4","v":1.35}]
[null,4,0.2,0.2,4.5,{"$f":"E5*D5*C5*B5","v":0.72000000000000008}]
[null,4,0.3,0.3,2.8,{"$f":"E6*D6*C6*B6","v":1.008}]
[]
[null,"Quantidade","D1 (m)","D2 (m)","D3 (m)","Sub-total","Total"]
{"$rows_left_out":1}
{"sheet":" 6-Inventário de recursos","index":7,"n_rows":500,"n_cols":15,"rows_kept":500,"cut":false,"hidden":false,"merged":[[3,0,3,14],[2,6,2,9],[0,0,0,14],[2,2,2,4],[2,10,2,14],[2,0,2,1],[1,0,1,14]]}
["Inventário de Recursos"]
["Materiais/Elementos e Resíduos de Construção e Demolição (RCD)"]
["Data do inventário",null,null,null,null,null,"Data das visitas in situ"]
[]
["ID","Material","LoW Code","Nature of waste","Quantity","Unit","Conversion factor","Estimated quantity (kg)","Quality (Condition)","Floor","Location(s) of material in building / building site","Recommended destination (auditor)","Precautions to take","Additional information","Photo"]
["ID","Material / Elemento","Código LER","Natureza do resíduos","Quantidade","Unidade","Fator de conversão","Quantidade estimada (kg)","Condição","Andar","Localização","Destino recomendado","Precauções a tomar","Informações adicionais","Fotografia"]
["E1","betão",{"$f":"IFERROR(VLOOKUP($B7,Ref!B$3:C$52,2,FALSE),0)","v":"17 01 01 "},"Inerte/Não perigoso",5,"m3",{"$f":"IFERROR(VLOOKUP($B7,Ref!$B$3:$E$52,3,FALSE),0)","v":2300},{"$f":"Table2[[#This Row],[Quantidade]]*Table2[[#This Row],[Fator de conversão]]","v":11500},"Boa – Anomalias estéticas",1,"Estrutura da cobertura","Reciclagem na obra"]
["E2","vidro",{"$f":"IFERROR(VLOOKUP($B8,Ref!B$3:C$52,2,FALSE),0)","v":"17 02 02 "},"Inerte/Não perigoso",1,"m3",{"$f":"IFERROR(VLOOKUP($B8,Ref!$B$3:$E$52,3,FALSE),0)","v":2500},{"$f":"Table2[[#This Row],[Quantidade]]*Table2[[#This Row],[Fator de conversão]]","v":2500},"Muito boa – Anomalias insignificantes",1,"Tipo de envidraçado de vãos exteriores","Preparação para reutilizar elemento/material na obra"]
{"$rows_left_out":493}
{"sheet":"7-Síntese da auditoria","index":8,"n_rows":537,"n_cols":36,"rows_kept":537,"cut":false,"hidden":false,"merged":[[0,0,0,14],[12,0,12,3],[2,0,2,1],[3,0,3,1],[1,0,1,1],[8,0,10,0],[4,0,4,1],[1,2,1,4],[1,5,1,14],[5,0,5,1],[6,0,6,1],[7,0,7,1],[11,0,11,1],[12,5,13,10],[12,13,13,13],[12,11,13,11],[12,12,13,12],[13,0,13,3],[30,9,30,11],[30,12,30,14],[39,0,39,1],[35,0,36,1],[35,2,36,2],[35,5,36,5],[35,6,36,6],[35,3,36,3],[35,4,36,4],[38,0,38,1],[33,0,34,6],[29,8,29,14],[30,8,31,8],[37,0,37,1]]}
["Síntese da auditoria"]
[null,null,"Totais dos subcapítulos específicos",null,null,"Subcapítulos específicos de elementos/materiais e RCD reportados",null,null,null,null,null,null,null,null,null,null,null,null,null,null,null,null,null,null,null,null,"Material","Nature of waste","LoW Code","Quantity","Unit","Conversion factor","Estimated quantity (kg)","Best treatment recommended (auditor)","Probable treatment (waste manager)","Precautions to take"]
[null,null,"Massa (kg)","Massa por unidade de área de demolição          (kg / m2)","Fração","Betão, tijolo, ladrilhos, cerâmica","Madeira","Vidro","Plástico","Madeira, vidro, plástico perigosos","Misturas betuminosas","Metais","Materiais de isolamento","Gesso","Misturas",null,null,null,null,null,null,null,null,null,null,null,"Material","Natureza do resíduos","Código LER","Quantidade","Unidade","Fator de conversão","Quantidade estimada (kg)","Melhor tratamento recomendado (auditor)","Tratamento provável (diracao de resíduos)","Precauções a tomar"]
["Reutilização de elementos/materiais",null,{"$f":"SUM(F4:O4)","v":1500},{"$f":"C4/$E$13","v":10},{"$f":"C4/$C$12","v":9.4667087409277373E-2},{"$f":"SUMIFS(AG4:AG537,AC4:AC537,\"*17 01*\",AI4:AI537,\"*reutilização*\")","v":1500},{"$f":"SUMIFS(AG4:AG537,AC4:AC537,\"*17 02 01*\",AI4:AI537,\"*reutilização*\")","v":0},{"$f":"SUMIFS(AG4:AG537,AC4:AC537,\"*17 02 02*\",AI4:AI537,\"*reutilização*\")","v":0},{"$f":"SUMIFS(AG4:AG537,AC4:AC537,\"*17 02 03*\",AI4:AI537,\"*reutilização*\")","v":0},{"$f":"SUMIFS(AG4:AG537,AC4:AC537,\"*17 02 04*\",AI4:AI537,\"*reutilização*\")","v":0},{"$f":"SUMIFS(AG4:AG537,AC4:AC537,\"*17 03*\",AI4:AI537,\"*reutilização*\")","v":0},{"$f":"SUMIFS(AG4:AG537,AC4:AC537,\"*17 04*\",AI4:AI537,\"*reutilização*\")","v":0},{"$f":"SUMIFS(AG4:AG537,AC4:AC537,\"*17 06*\",AI4:AI537,\"*reutilização*\")","v":0},{"$f":"SUMIFS(AG4:AG537,AC4:AC537,\"*17 08*\",AI4:AI537,\"*reutilização*\")","v":0},{"$f":"SUMIFS(AG4:AG537,AC4:AC537,\"*17 09*\",AI4:AI537,\"*reutilização*\")","v":0},null,null,null,null,null,null,null,null,null,null,null,{"$f":"' 6-Inventário de recursos'!B7","v":"betão"},{"$f":"' 6-Inventário de recursos'!D7","v":"Inerte/Não perigoso"},{"$f":"' 6-Inventário de recursos'!C7","v":"17 01 01 "},{"$f":"' 6-Inventário de recursos'!E7","v":5},{"$f":"' 6-Inventário de recursos'!F7","v":"m3"},{"$f":"' 6-Inventário de recursos'!G7","v":2300},{"$f":"' 6-Inventário de recursos'!H7","v":11500},{"$f":"' 6-Inventário de recursos'!L7","v":"Reciclagem na obra"},{"$f":"' 6-Inventário de recursos'!L7","v":"Reciclagem na obra"},{"$f":"' 6-Inventário de recursos'!M7","v":0}]
["Preparação reutilização de elemento/materiais",null,2500,16.666666666666668,0.1577784790154623,{"$f":"SUMIFS(AG4:AG537,AC4:AC537,\"*17 01*\",AI4:AI537,\"*preparação*\")","v":0},{"$f":"SUMIFS(AG4:AG537,AC4:AC537,\"*17 02 01*\",AI4:AI537,\"*preparação*\")","v":0},{"$f":"SUMIFS(AG4:AG537,AC4:AC537,\"*17 02 02*\",AI4:AI537,\"*preparação*\")","v":2500},{"$f":"SUMIFS(AG4:AG537,AC4:AC537,\"*17 02 03*\",AI4:AI537,\"*preparação*\")","v":0},{"$f":"SUMIFS(AG4:AG537,AC4:AC537,\"*17 02 04*\",AI4:AI537,\"*preparação*\")","v":0},{"$f":"SUMIFS(AG4:AG537,AC4:AC537,\"*17 03*\",AI4:AI537,\"*preparação*\")","v":0},{"$f":"SUMIFS(AG4:AG537,AC4:AC537,\"*17 04*\",AI4:AI537,\"*preparação*\")","v":0},{"$f":"SUMIFS(AG4:AG537,AC4:AC537,\"*17 06*\",AI4:AI537,\"*preparação*\")","v":0},{"$f":"SUMIFS(AG4:AG537,AC4:AC537,\"*17 08*\",AI4:AI537,\"*preparação*\")","v":0},{"$f":"SUMIFS(AG4:AG537,AC4:AC537,\"*17 09*\",AI4:AI537,\"*preparação*\")","v":0},null,null,null,null,null,null,null,null,null,null,null,{"$f":"' 6-Inventário de recursos'!B8","v":"vidro"},{"$f":"' 6-Inventário de recursos'!D8","v":"Inerte/Não perigoso"},{"$f":"' 6-Inventário de recursos'!C8","v":"17 02 02 "},{"$f":"' 6-Inventário de recursos'!E8","v":1},{"$f":"' 6-Inventário de recursos'!F8","v":"m3"},{"$f":"' 6-Inventário de recursos'!G8","v":2500},{"$f":"' 6-Inventário de recursos'!H8","v":2500},{"$f":"' 6-Inventário de recursos'!L8","v":"Preparação para reutilizar elemento/material na obra"},{"$f":"' 6-Inventário de recursos'!L8","v":"Preparação para reutilizar elemento/material na obra"},{"$f":"' 6-Inventário de recursos'!M8","v":0}]
["Reciclagem",null,11500,76.666666666666671,0.72578100347112651,{"$f":"SUMIFS(AG4:AG537,AC4:AC537,\"*17 01*\",AI4:AI537,\"*Reciclagem*\")","v":11500},{"$f":"SUMIFS(AG4:AG537,AC4:AC537,\"*17 02 01*\",AI4:AI537,\"*Reciclagem*\")","v":0},{"$f":"SUMIFS(AG4:AG537,AC4:AC537,\"*17 02 02*\",AI4:AI537,\"*Reciclagem*\")","v":0},{"$f":"SUMIFS(AG4:AG537,AC4:AC537,\"*17 02 03*\",AI4:AI537,\"*Reciclagem*\")","v":0},{"$f":"SUMIFS(AG4:AG537,AC4:AC537,\"*17 02 04*\",AI4:AI537,\"*Reciclagem*\")","v":0},{"$f":"SUMIFS(AG4:AG537,AC4:AC537,\"*17 03*\",AI4:AI537,\"*Reciclagem*\")","v":0},{"$f":"SUMIFS(AG4:AG537,AC4:AC537,\"*17 04*\",AI4:AI537,\"*Reciclagem*\")","v":0},{"$f":"SUMIFS(AG4:AG537,AC4:AC537,\"*17 06*\",AI4:AI537,\"*Reciclagem*\")","v":0},{"$f":"SUMIFS(AG4:AG537,AC4:AC537,\"*17 08*\",AI4:AI537,\"*Reciclagem*\")","v":0},{"$f":"SUMIFS(AG4:AG537,AC4:AC537,\"*17 09*\",AI4:AI537,\"*Reciclagem*\")","v":0},null,null,null,null,null,null,null,null,null,null,null,{"$f":"' 6-Inventário de recursos'!B9","v":"madeira"},{"$f":"' 6-Inventário de recursos'!D9","v":"Inerte/Não perigoso"},{"$f":"' 6-Inventário de recursos'!C9","v":"17 02 01 "},{"$f":"' 6-Inventário de recursos'!E9","v":300},{"$f":"' 6-Inventário de recursos'!F9","v":"kg"},{"$f":"' 6-Inventário de recursos'!G9","v":700},{"$f":"' 6-Inventário de recursos'!H9","v":300},{"$f":"' 6-Inventário de recursos'!L9","v":"Recuperação no local como material enchimento "},{"$f":"' 6-Inventário de recursos'!L9","v":"Recuperação no local como material enchimento "},{"$f":"' 6-Inventário de recursos'!M9","v":0}]
["Valorização de material (enchimento)",null,300,2,1.8933417481855473E-2,{"$f":"SUMIFS(AG4:AG537,AC4:AC537,\"*17 01*\",AI4:AI537,\"*enchimento*\")","v":0},{"$f":"SUMIFS(AG4:AG537,AC4:AC537,\"*17 02 01*\",AI4:AI537,\"*enchimento*\")","v":300},{"$f":"SUMIFS(AG4:AG537,AC4:AC537,\"*17 02 02*\",AI4:AI537,\"*enchimento*\")","v":0},{"$f":"SUMIFS(AG4:AG537,AC4:AC537,\"*17 02 03*\",AI4:AI537,\"*enchimento*\")","v":0},{"$f":"SUMIFS(AG4:AG537,AC4:AC537,\"*17 02 04*\",AI4:AI537,\"*enchimento*\")","v":0},{"$f":"SUMIFS(AG4:AG537,AC4:AC537,\"*17 03*\",AI4:AI537,\"*enchimento*\")","v":0},{"$f":"SUMIFS(AG4:AG537,AC4:AC537,\"*17 04*\",AI4:AI537,\"*enchimento*\")","v":0},{"$f":"SUMIFS(AG4:AG537,AC4:AC537,\"*17 06*\",AI4:AI537,\"*enchimento*\")","v":0},{"$f":"SUMIFS(AG4:AG537,AC4:AC537,\"*17 08*\",AI4:AI537,\"*enchimento*\")","v":0},{"$f":"SUMIFS(AG4:AG537,AC4:AC537,\"*17 09*\",AI4:AI537,\"*enchimento*\")","v":0},null,null,null,null,null,null,null,null,null,null,null,{"$f":"' 6-Inventário de recursos'!B10","v":"ladrilhos, telhas e materiais cerâmicos"},{"$f":"' 6-Inventário de recursos'!D10","v":"Inerte/Não perigoso"},{"$f":"' 6-Inventário de recursos'!C10","v":"17 01 03 "},{"$f":"' 6-Inventário de recursos'!E10","v":1500},{"$f":"' 6-Inventário de recursos'!F10","v":"kg"},{"$f":"' 6-Inventário de recursos'!G10","v":830.6},{"$f":"' 6-Inventário de recursos'!H10","v":1500},{"$f":"' 6-Inventário de recursos'!L10","v":"Reutilização do elemento/material fora da obra"},{"$f":"' 6-Inventário de recursos'!L10","v":"Reutilização do elemento/material fora da obra"},{"$f":"' 6-Inventário de recursos'!M10","v":0}]
["Recuperação de energia",null,0,{"$f":"C8/$E$13","v":0},0,{"$f":"SUMIFS(AG4:AG537,AC4:AC537,\"*17 01*\",AI4:AI537,\"*energia*\")","v":0},{"$f":"SUMIFS(AG4:AG537,AC4:AC537,\"*17 02 01*\",AI4:AI537,\"*energia*\")","v":0},{"$f":"SUMIFS(AG4:AG537,AC4:AC537,\"*17 02 02*\",AI4:AI537,\"*energia*\")","v":0},{"$f":"SUMIFS(AG4:AG537,AC4:AC537,\"*17 02 03*\",AI4:AI537,\"*energia*\")","v":0},{"$f":"SUMIFS(AG4:AG537,AC4:AC537,\"*17 02 04*\",AI4:AI537,\"*energia*\")","v":0},{"$f":"SUMIFS(AG4:AG537,AC4:AC537,\"*17 03*\",AI4:AI537,\"*energia*\")","v":0},{"$f":"SUMIFS(AG4:AG537,AC4:AC537,\"*17 04*\",AI4:AI537,\"*energia*\")","v":0},{"$f":"SUMIFS(AG4:AG537,AC4:AC537,\"*17 06*\",AI4:AI537,\"*energia*\")","v":0},{"$f":"SUMIFS(AG4:AG537,AC4:AC537,\"*17 08*\",AI4:AI537,\"*energia*\")","v":0},{"$f":"SUMIFS(AG4:AG537,AC4:AC537,\"*17 09*\",AI4:AI537,\"*energia*\")","v":0},null,null,null,null,null,null,null,null,null,null,null,{"$f":"' 6-Inventário de recursos'!B11","v":"vidro, plástico e madeira contendo ou contaminados com substâncias perigosas"},{"$f":"' 6-Inventário de recursos'!D11","v":"Perigoso"},{"$f":"' 6-Inventário de recursos'!C11","v":"17 02 04*"},{"$f":"' 6-Inventário de recursos'!E11","v":45},{"$f":"' 6-Inventário de recursos'!F11","v":"kg"},{"$f":"' 6-Inventário de recursos'!G11","v":0},{"$f":"' 6-Inventário de recursos'!H11","v":45},{"$f":"' 6-Inventário de recursos'!L11","v":"Aterro de resíduos perigosos"},{"$f":"' 6-Inventário de recursos'!L11","v":"Aterro de resíduos perigosos"},{"$f":"' 6-Inventário de recursos'!M11","v":0}]
{"$rows_left_out":530}
{"sheet":"8-Elemento de construção","index":9,"n_rows":35,"n_cols":2,"rows_kept":35,"cut":false,"hidden":false,"merged":[[14,0,14,6],[16,0,16,6],[18,0,18,6],[17,0,17,6],[0,0,0,6],[3,0,3,6],[12,0,12,6],[9,1,9,6],[10,1,10,6],[11,1,11,6],[4,0,4,6],[13,0,13,6],[1,1,1,6],[2,1,2,6],[5,0,5,6],[6,1,6,6],[8,1,8,6],[7,1,7,6],[19,0,19,6],[15,0,15,6],[20,0,20,16383],[21,0,21,6],[34,0,34,6]]}
["Elemento de construção"]
["ID","Nome"]
["<inserir conteúdo>","<inserir conteúdo>"]
["Fotografias"]
[]
["Informação detalhada do elemento"]
["Marca","<inserir conteúdo>"]
["Especificidades","<inserir conteúdo>"]
{"$rows_left_out":28}
{"sheet":"9-Lista de resíduos","index":10,"n_rows":72,"n_cols":3,"rows_kept":72,"cut":false,"hidden":false,"merged":[[0,0,0,2],[1,0,1,2],[51,0,51,2]]}
["Lista de resíduos"]
["Códigos LER para RCD (cap 17) e REEE (cap 16 e 20)"]
["17 01 ","betão, tijolos, ladrilhos, telhas e materiais cerâmicos","Anotado"]
["17 01 01 ","betão","Esp NP"]
["17 01 02 ","tijolos","Esp NP"]
["17 01 03 ","ladrilhos, telhas e materiais cerâmicos","Esp NP"]
["17 01 06* ","misturas ou frações separadas de betão, tijolos, ladrilhos, telhas e materiais cerâmicos, contendo substâncias perigosas","Esp P"]
["17 01 07 ","misturas de betão, tijolos, ladrilhos, telhas e materiais cerâmicos, não abrangidas em 17 01 06","Esp NP"]
{"$rows_left_out":65}
{"sheet":"10-Glossário","index":11,"n_rows":45,"n_cols":2,"rows_kept":45,"cut":false,"hidden":false,"merged":[[0,0,0,1],[1,0,1,1]]}
["Glossário"]
[]
["Atividade de construção","Atividade que tem por objeto a realização de obras, englobando todo o conjunto de atos que sejam necessários à sua concretização."]
["Armazenagem","Deposição controlada de resíduos, antes do seu tratamento e por prazo determinado, designadamente as operações R 13 e D 15."]
["Armazenagem preliminar","Deposição controlada de resíduos em instalações onde os resíduos são descarregados a fim de serem preparados para posterior transporte para efeitos de tratamento, como parte do processo de recolha."]
["Auditor","Perito ou a equipa de peritos que realiza a auditoria pré‑demolição agindo em nome do proprietário."]
["Auditoria pré-demolição","Atividade preparatória com o objetivo de (1) recolher informação sobre as qualidades e quantidades dos materiais, elementos e resíduos de construção e demolição que serão retirados durante as obras de demolição ou reabilitação de edifícios e (2) fornecer recomendações gerais e específicas visando a recuperação futura desses materiais, elementos e RCD recolhidos."]
["Autoridade","Organismo administrativo responsável pela concessão das licenças de demolição ou renovação e pela fiscalização do processo de demolição ou renovação."]
{"$rows_left_out":38}
{"sheet":"Ref","index":12,"n_rows":111,"n_cols":9,"rows_kept":111,"cut":false,"hidden":true,"merged":[]}
[]
[null,"Nome","Código","Massa volúmica","Unidade",null,"Natureza do resíduos",null,"Localização"]
[null,"betão","17 01 01 ",2300,"kg/m3",null,null,null,"Fundações"]
[null,"tijolos","17 01 02 ",1920,"kg/m3",null,"Inerte/Não perigoso",null,"Elementos verticais"]
[null,"ladrilhos, telhas e materiais cerâmicos","17 01 03 ",830.6,"kg/m3",null,"Perigoso",null,"Pavimentos"]
[null,"misturas ou frações separadas de betão, tijolos, ladrilhos, telhas e materiais cerâmicos, contendo substâncias perigosas","17 01 06* ",830,"kg/m3",null,null,null,"Estrutura da cobertura"]
[null,"misturas de betão, tijolos, ladrilhos, telhas e materiais cerâmicos, não abrangidas em 17 01 06","17 01 07 ",830,"kg/m3",null,"Ensaio positivo ",null,"Revestimento da cobertura em terraço"]
[null,"madeira","17 02 01 ",700,"kg/m3",null,"Ensaio negativo",null,"Revestimento da cobertura inclinada"]
{"$rows_left_out":103}